Target
Cathepsin D
Ligand
BDBM50294218
Substrate
Meas. Tech.
ChEMBL_574524 (CHEMBL1030363)
IC50
1±n/a nM
Citation
 Machauer, RLaumen, KVeenstra, SRondeau, JMTintelnot-Blomley, MBetschart, CJaton, ALDesrayaud, SStaufenbiel, MRabe, SPaganetti, PNeumann, U Macrocyclic peptidomimetic beta-secretase (BACE-1) inhibitors with activity in vivo. Bioorg Med Chem Lett 19:1366-70 (2009)  
Target
Name:
Cathepsin D
Synonyms:
CATD_HUMAN CTSD Cathepsin D heavy chain Cathepsin D precursor
Type:
Enzyme
Mol. Mass.:
44551.72
Organism:
Homo sapiens (Human)
Description:
Human proCathepsin D (SwissProt accession number P07339) was expressed in Sf9 cells, purified, and autoactivated.
Residue:
412
  
Inhibitor
Name:
BDBM50294218
Synonyms:
(3S,14R,16S)-16-((R)-1-hydroxy-2-((S)-6-isopropyl-2,2-dimethylchroman-4-ylamino)ethyl)-3,4,14-trimethyl-1,4-diazacyclohexadecane-2,5-dione | CHEMBL558488
Type:
Small organic molecule
Emp. Form.:
C33H55N3O4
Mol. Mass.:
557.8075
SMILES:
CC(C)c1ccc2OC(C)(C)C[C@H](NC[C@@H](O)[C@@H]3C[C@H](C)CCCCCCCCC(=O)N(C)[C@@H](C)C(=O)N3)c2c1
: