Target
Sodium-dependent noradrenaline transporter
Ligand
BDBM50294260
Substrate
Meas. Tech.
ChEMBL_575205 (CHEMBL1024552)
IC50
91±n/a nM
Citation
 Fish, PVAndrews, MDJonathan Fray, MStobie, AWakenhut, FWhitlock, GA 4-Piperidines and 3-pyrrolidines as dual serotonin and noradrenaline reuptake inhibitors: design, synthesis and structure-activity relationships. Bioorg Med Chem Lett 19:2829-34 (2009)  
Target
Name:
Sodium-dependent noradrenaline transporter
Synonyms:
Monoamine transporter NET Noradrenaline Transporter (NET) Norepinephrine transporter protein (NET) SLC6A2 Sodium-dependent noradrenaline transporter (NET) | Solute carrier family 6 member 2
Type:
Multi-pass membrane protein
Mol. Mass.:
69337.72
Organism:
Homo sapiens (Human)
Description:
P23975
Residue:
617
  
Inhibitor
Name:
BDBM50294260
Synonyms:
CHEMBL550289 | rac-3-((2-ethylphenoxy)(piperidin-4-yl)methyl)pyridine
Type:
Small organic molecule
Emp. Form.:
C19H24N2O
Mol. Mass.:
296.4067
SMILES:
CCc1ccccc1OC(C1CCNCC1)c1cccnc1
: