Target
Sodium-dependent dopamine transporter
Ligand
BDBM50294273
Substrate
Meas. Tech.
ChEMBL_575207 (CHEMBL1024554)
IC50
1270±n/a nM
Citation
 Fish, PVAndrews, MDJonathan Fray, MStobie, AWakenhut, FWhitlock, GA 4-Piperidines and 3-pyrrolidines as dual serotonin and noradrenaline reuptake inhibitors: design, synthesis and structure-activity relationships. Bioorg Med Chem Lett 19:2829-34 (2009)  
Target
Name:
Sodium-dependent dopamine transporter
Synonyms:
DA transporter DAT1 Dopamine transporter protein (DAT) SC6A3_HUMAN Sodium-dependent dopamine transporter Solute carrier family 6 member 3
Type:
Multi-pass membrane protein
Mol. Mass.:
68497.11
Organism:
Homo sapiens (Human)
Description:
Q01959
Residue:
620
  
Inhibitor
Name:
BDBM50294273
Synonyms:
CHEMBL562854 | rac-3-((2,3-dimethylphenoxy)(piperidin-4-yl)methyl)pyridine
Type:
Small organic molecule
Emp. Form.:
C19H24N2O
Mol. Mass.:
296.4067
SMILES:
Cc1cccc(OC(C2CCNCC2)c2cccnc2)c1C
: