Target
DNA (cytosine-5)-methyltransferase 1
Ligand
BDBM50294487
Substrate
Meas. Tech.
ChEMBL_575565 (CHEMBL1036408)
IC50
21000±n/a nM
Citation
 Saavedra, OMIsakovic, LLlewellyn, DBZhan, LBernstein, NClaridge, SRaeppel, FVaisburg, AElowe, NPetschner, AJRahil, JBeaulieu, NMacLeod, ARDelorme, DBesterman, JMWahhab, A SAR around (l)-S-adenosyl-l-homocysteine, an inhibitor of human DNA methyltransferase (DNMT) enzymes. Bioorg Med Chem Lett 19:2747-51 (2009)  
Target
Name:
DNA (cytosine-5)-methyltransferase 1
Synonyms:
AIM CXXC9 DNA (cytosine-5)-methyltransferase 1 isoform b DNA methyltransferase HsaI DNMT1 M.HsaI | MCMT
Type:
Enzyme
Mol. Mass.:
183184.85
Organism:
Homo sapiens (Human)
Description:
P26358
Residue:
1616
  
Inhibitor
Name:
BDBM50294487
Synonyms:
2-amino-4-(((2S,3S,4R,5R)-5-(6-amino-2-iodo-9H-purin-9-yl)-3,4-dihydroxy-tetrahydrofuran-2-yl)methylthio)butanoic acid | CHEMBL558882
Type:
Small organic molecule
Emp. Form.:
C14H19IN6O5S
Mol. Mass.:
510.307
SMILES:
NC(CCSC[C@H]1O[C@H]([C@H](O)[C@@H]1O)n1cnc2c(N)nc(I)nc12)C(O)=O
: