Target
DNA (cytosine-5)-methyltransferase 3B
Ligand
BDBM50294563
Substrate
Meas. Tech.
ChEMBL_575600 (CHEMBL1036445)
IC50
11000±n/a nM
Citation
 Isakovic, LSaavedra, OMLlewellyn, DBClaridge, SZhan, LBernstein, NVaisburg, AElowe, NPetschner, AJRahil, JBeaulieu, NGauthier, FMacLeod, ARDelorme, DBesterman, JMWahhab, A Constrained (l-)-S-adenosyl-l-homocysteine (SAH) analogues as DNA methyltransferase inhibitors. Bioorg Med Chem Lett 19:2742-6 (2009)  
Target
Name:
DNA (cytosine-5)-methyltransferase 3B
Synonyms:
DNM3B_HUMAN | DNMT3B
Type:
PROTEIN
Mol. Mass.:
95771.12
Organism:
Homo sapiens (Human)
Description:
ChEMBL_1473708
Residue:
853
  
Inhibitor
Name:
BDBM50294563
Synonyms:
(2S,4S)-4-(((2S,3S,4R,5R)-5-(6-amino-9H-purin-9-yl)-3,4-dihydroxytetrahydrofuran-2-yl)methylthio)-1-methylpyrrolidine-2-carboxylic acid | CHEMBL558883
Type:
Small organic molecule
Emp. Form.:
C16H22N6O5S
Mol. Mass.:
410.448
SMILES:
CN1C[C@H](C[C@H]1C(O)=O)SC[C@H]1O[C@H](C(O)[C@@H]1O)n1cnc2c(N)ncnc12
: