Target
Prokineticin receptor 1
Ligand
BDBM50294589
Substrate
Meas. Tech.
ChEMBL_575799 (CHEMBL1057723)
IC50
21±n/a nM
Citation
 Ralbovsky, JLLisko, JGPalmer, JMMabus, JChevalier, KMSchulz, MJDyatkin, ABMiskowski, TACoats, SJHornby, PHe, W Triazinediones as prokineticin 1 receptor antagonists. Part 1: SAR, synthesis and biological evaluation. Bioorg Med Chem Lett 19:2661-3 (2009)  
Target
Name:
Prokineticin receptor 1
Synonyms:
G-protein coupled receptor 73 GPR73 PK-R1 PKR1_HUMAN | PROKR1
Type:
enzyme
Mol. Mass.:
44779.92
Organism:
Homo sapiens (Human)
Description:
Q8TCW9
Residue:
393
  
Inhibitor
Name:
BDBM50294589
Synonyms:
1-(2-(1,5-bis(4-methoxybenzyl)-4,6-dioxo-1,4,5,6-tetrahydro-1,3,5-triazin-2-ylamino)ethyl)guanidine | CHEMBL562111
Type:
Small organic molecule
Emp. Form.:
C22H27N7O4
Mol. Mass.:
453.4943
SMILES:
[#6]-[#8]-c1ccc(-[#6]-n2c(-[#7]-[#6]-[#6]\[#7]=[#6](\[#7])-[#7])nc(=O)n(-[#6]-c3ccc(-[#8]-[#6])cc3)c2=O)cc1
: