Target
Adenosine receptor A3
Ligand
BDBM50294668
Substrate
Meas. Tech.
ChEMBL_575814 (CHEMBL1024515)
Ki
82.8±n/a nM
Citation
 Pal, SChoi, WJChoe, SAHeller, CLGao, ZGChinn, MJacobson, KAHou, XLee, SKKim, HOJeong, LS Structure-activity relationships of truncated adenosine derivatives as highly potent and selective human A3 adenosine receptor antagonists. Bioorg Med Chem 17:3733-8 (2009)  
Target
Name:
Adenosine receptor A3
Synonyms:
AA3R_RAT Adenosine receptor A2a and A3 | Adora3
Type:
PROTEIN
Mol. Mass.:
36643.73
Organism:
Rattus norvegicus
Description:
ChEMBL_479910
Residue:
320
  
Inhibitor
Name:
BDBM50294668
Synonyms:
(2R,3R,4R)-2-(2-Chloro-6-(3-bromobenzylamino)-9Hpurin-9-yl)-tetrahydrofuran-3,4-diol | CHEMBL561976
Type:
Small organic molecule
Emp. Form.:
C16H15BrClN5O3
Mol. Mass.:
440.679
SMILES:
O[C@@H]1CO[C@H]([C@@H]1O)n1cnc2c(NCc3cccc(Br)c3)nc(Cl)nc12
: