Target
Proto-oncogene Wnt-3
Ligand
BDBM50294790
Substrate
Meas. Tech.
ChEMBL_576549 (CHEMBL1032002)
EC50
>25000±n/a nM
Citation
 Lu, JMa, ZHsieh, JCFan, CWChen, BLonggood, JCWilliams, NSAmatruda, JFLum, LChen, C Structure-activity relationship studies of small-molecule inhibitors of Wnt response. Bioorg Med Chem Lett 19:3825-7 (2009)  
Target
Name:
Proto-oncogene Wnt-3
Synonyms:
INT4 WNT3 | WNT3_HUMAN
Type:
PROTEIN
Mol. Mass.:
39653.31
Organism:
Homo sapiens (Human)
Description:
ChEMBL_576549
Residue:
355
  
Inhibitor
Name:
BDBM50294790
Synonyms:
4-((1R,2S,6R,7R)-3,5-Dioxo-4-aza-tricyclo[5.2.1.0*2,6*]dec-8-en-4-yl)-N-phenyl-benzamide | CHEMBL562944
Type:
Small organic molecule
Emp. Form.:
C22H18N2O3
Mol. Mass.:
358.3899
SMILES:
Oc1c2[C@@H]3C[C@H](C=C3)c2c(O)n1-c1ccc(cc1)C(=O)Nc1ccccc1
: