Target
Proto-oncogene Wnt-3
Ligand
BDBM50294799
Substrate
Meas. Tech.
ChEMBL_576549 (CHEMBL1032002)
EC50
1000±n/a nM
Citation
 Lu, JMa, ZHsieh, JCFan, CWChen, BLonggood, JCWilliams, NSAmatruda, JFLum, LChen, C Structure-activity relationship studies of small-molecule inhibitors of Wnt response. Bioorg Med Chem Lett 19:3825-7 (2009)  
Target
Name:
Proto-oncogene Wnt-3
Synonyms:
INT4 WNT3 | WNT3_HUMAN
Type:
PROTEIN
Mol. Mass.:
39653.31
Organism:
Homo sapiens (Human)
Description:
ChEMBL_576549
Residue:
355
  
Inhibitor
Name:
BDBM50294799
Synonyms:
CHEMBL551249 | N-(4-Bromo-phenyl)-4-((1R,2S,6R,7S)-3,5-dioxo-4-aza-tricyclo[5.2.1.0*2,6*]dec-8-en-4-yl)-benzamide
Type:
Small organic molecule
Emp. Form.:
C22H17BrN2O3
Mol. Mass.:
437.286
SMILES:
Oc1c2[C@H]3C[C@H](C=C3)c2c(O)n1-c1ccc(cc1)C(=O)Nc1ccc(Br)cc1
: