Target
Histamine H3 receptor
Ligand
BDBM50246289
Substrate
Meas. Tech.
ChEMBL_577509 (CHEMBL1057861)
Kd
2.6±n/a nM
Citation
 Mitobe, YIto, SMizutani, TNagase, TSato, NTokita, S Development of a selective and potent radioactive ligand for histamine H(3) receptors: A compound potentially useful for receptor occupancy studies. Bioorg Med Chem Lett 19:4075-8 (2009)  
Target
Name:
Histamine H3 receptor
Synonyms:
HH3R Hrh3
Type:
PROTEIN
Mol. Mass.:
48560.37
Organism:
Mus musculus
Description:
ChEMBL_988451
Residue:
445
  
Inhibitor
Name:
BDBM50246289
Synonyms:
3-methyl-2-(4-(3-(pyrrolidin-1-yl)propoxy)phenyl)quinazolin-4(3H)-one CHEMBL557214
Type:
Small organic molecule
Emp. Form.:
C22H25N3O2
Mol. Mass.:
363.4528
SMILES:
Cn1c(nc2ccccc2c1=O)-c1ccc(OCCCN2CCCC2)cc1
: