Target
Neuromedin-B receptor
Ligand
BDBM50295247
Substrate
Meas. Tech.
ChEMBL_577514 (CHEMBL1057866)
IC50
280±n/a nM
Citation
 Fu, JShuttleworth, SJConnors, RVChai, ACoward, P Discovery and optimization of a novel Neuromedin B receptor antagonist. Bioorg Med Chem Lett 19:4264-7 (2009)  
Target
Name:
Neuromedin-B receptor
Synonyms:
Bombesin 1 NMBR Neuromedin B Neuromedin-B receptor | Neuromedin-B-preferring bombesin receptor
Type:
Enzyme Catalytic Domain
Mol. Mass.:
43447.11
Organism:
Homo sapiens (Human)
Description:
Bombesin 1 NMBR 0::P28336
Residue:
390
  
Inhibitor
Name:
BDBM50295247
Synonyms:
11-(2-chlorophenyl)-3,3,8-trimethyl-2,3,4,5,10,11-hexahydro-1H-dibenzo[b,e][1,4]diazepin-1-one | CHEMBL564151
Type:
Small organic molecule
Emp. Form.:
C22H23ClN2O
Mol. Mass.:
366.884
SMILES:
Cc1ccc2N=C3CC(C)(C)CC(=O)C3C(Nc2c1)c1ccccc1Cl
: