Target
Interleukin-8
Ligand
BDBM50169048
Substrate
Meas. Tech.
ChEMBL_577736 (CHEMBL1052371)
IC50
20±n/a nM
Citation
 Sablone, MRCesta, MCMoriconi, AAramini, ABizzarri, CDi Giacinto, CDi Bitondo, RGloaguen, IAschi, MCrucianelli, MBertini, RAllegretti, M Structure-Activity Relationship of novel phenylacetic CXCR1 inhibitors. Bioorg Med Chem Lett 19:4026-30 (2009)  
Target
Name:
Interleukin-8
Synonyms:
CXCL8 IL8_HUMAN interleukin 8 precursor
Type:
PROTEIN
Mol. Mass.:
11104.05
Organism:
Homo sapiens (Human)
Description:
ChEMBL_577736
Residue:
99
  
Inhibitor
Name:
BDBM50169048
Synonyms:
(R)-2-(3-Benzoyl-phenyl)-propionic acid (R)-2-(3-benzoylphenyl)propanoic acid KETOPROFEN
Type:
Small organic molecule
Emp. Form.:
C16H14O3
Mol. Mass.:
254.2806
SMILES:
C[C@@H](C(O)=O)c1cccc(c1)C(=O)c1ccccc1
: