Target
Cyclin-dependent kinase 5
Ligand
BDBM50295354
Substrate
Meas. Tech.
ChEMBL_578399 (CHEMBL1057955)
IC50
>10000±n/a nM
Citation
 Corbel, CHaddoub, RGuiffant, DLozach, OGueyrard, DLemoine, JRatin, MMeijer, LBach, SGoekjian, P Identification of potential cellular targets of aloisine A by affinity chromatography. Bioorg Med Chem 17:5572-82 (2009)  
Target
Name:
Cyclin-dependent kinase 5
Synonyms:
CDK5 CDKN5 Cyclin-dependent kinase 5 (CDK5/ p25) Cyclin-dependent-like kinase 5 PSSALRE Tau protein kinase II catalytic subunit
Type:
Enzyme Subunit
Mol. Mass.:
33308.61
Organism:
Homo sapiens (Human)
Description:
Residue:
292
  
Inhibitor
Name:
BDBM50295354
Synonyms:
2-(1-{2-[2-(2-Aminoethoxy)ethoxy]ethyl}-1H-[1,2,3]triazol-4-yl)-4-(7-butyl-5H-pyrrolo[2,3-b]pyrazin-6-yl)phenol | CHEMBL557499
Type:
Small organic molecule
Emp. Form.:
C24H31N7O3
Mol. Mass.:
465.548
SMILES:
CCCCc1c([nH]c2nccnc12)-c1ccc(O)c(c1)-c1cn(CCOCCOCCN)nn1
: