Target
NAD kinase
Ligand
BDBM50203628
Substrate
Meas. Tech.
ChEMBL_578494 (CHEMBL1063153)
IC50
90000±n/a nM
Citation
 Petrelli, RSham, YYChen, LFelczak, KBennett, EWilson, DAldrich, CYu, JSCappellacci, LFranchetti, PGrifantini, MMazzola, FDi Stefano, MMagni, GPankiewicz, KW Selective inhibition of nicotinamide adenine dinucleotide kinases by dinucleoside disulfide mimics of nicotinamide adenine dinucleotide analogues. Bioorg Med Chem 17:5656-64 (2009)  
Target
Name:
NAD kinase
Synonyms:
NADK | NADK_HUMAN
Type:
PROTEIN
Mol. Mass.:
49227.18
Organism:
Homo sapiens (Human)
Description:
ChEMBL_578494
Residue:
446
  
Inhibitor
Name:
BDBM50203628
Synonyms:
Benzamide adenine dinucleotide benzamideadeninedinucleoside
Type:
Small organic molecule
Emp. Form.:
C22H28N6O14P2
Mol. Mass.:
662.437
SMILES:
NC(=O)c1cccc(c1)[C@@H]1O[C@H](COP(O)(=O)OP(O)(=O)OC[C@H]2O[C@H]([C@H](O)[C@@H]2O)n2cnc3c(N)ncnc23)[C@@H](O)[C@H]1O
: