Target
Multidrug resistance-associated protein 1
Ligand
BDBM23414
Substrate
Meas. Tech.
ChEMBL_579093 (CHEMBL1062295)
IC50
3000±n/a nM
Citation
 Wong, ILChan, KFTsang, KHLam, CYZhao, YChan, THChow, LM Modulation of multidrug resistance protein 1 (MRP1/ABCC1)-mediated multidrug resistance by bivalent apigenin homodimers and their derivatives. J Med Chem 52:5311-22 (2009)  
Target
Name:
Multidrug resistance-associated protein 1
Synonyms:
7.6.2.2 ABCC1 ATP-binding cassette, sub-family C, member 1 isoform 1 LTC4 transporter MRP MRP1_HUMAN
Type:
Mol. Mass.:
171597.72
Organism:
Homo sapiens (Human)
Description:
P33527
Residue:
1531
  
Inhibitor
Name:
BDBM23414
Synonyms:
5,7-dihydroxy-2-(3-hydroxy-4-methoxyphenyl)-4H-chromen-4-one Diosmetin (25)
Type:
flavone
Emp. Form.:
C16H12O6
Mol. Mass.:
300.2629
SMILES:
COc1ccc(cc1O)-c1cc(=O)c2c(O)cc(O)cc2o1
: