Target
Multidrug resistance-associated protein 1
Ligand
BDBM50033767
Substrate
Meas. Tech.
ChEMBL_579091 (CHEMBL1062293)
Ki
5000±n/a nM
Citation
 Wong, ILChan, KFTsang, KHLam, CYZhao, YChan, THChow, LM Modulation of multidrug resistance protein 1 (MRP1/ABCC1)-mediated multidrug resistance by bivalent apigenin homodimers and their derivatives. J Med Chem 52:5311-22 (2009)  
Target
Name:
Multidrug resistance-associated protein 1
Synonyms:
7.6.2.2 ABCC1 ATP-binding cassette, sub-family C, member 1 isoform 1 LTC4 transporter MRP MRP1_HUMAN
Type:
Mol. Mass.:
171597.72
Organism:
Homo sapiens (Human)
Description:
P33527
Residue:
1531
  
Inhibitor
Name:
BDBM50033767
Synonyms:
3,3',4',5',7-pentahydroxy flavone 3,7-Dihydroxy-2-(3,4,5-trihydroxy-phenyl)-chromen-4-one CHEMBL170405 ROBINETIN | US11866416, Compound PAY
Type:
Small organic molecule
Emp. Form.:
C15H10O7
Mol. Mass.:
302.2357
SMILES:
Oc1ccc2c(c1)oc(-c1cc(O)c(O)c(O)c1)c(O)c2=O
: