Target
Macrophage metalloelastase
Ligand
BDBM28482
Substrate
Meas. Tech.
ChEMBL_579099 (CHEMBL1062301)
IC50
14±n/a nM
Citation
 Li, WLi, JWu, YRancati, FVallese, SRaveglia, LWu, JHotchandani, RFuller, NCunningham, KMorgan, PFish, SKrykbaev, RXu, XTam, SGoldman, SJAbraham, WWilliams, CSypek, JMansour, TS Identification of an orally efficacious matrix metalloprotease 12 inhibitor for potential treatment of asthma. J Med Chem 52:5408-19 (2009)  
Target
Name:
Macrophage metalloelastase
Synonyms:
HME MMP12_HUMAN Matrix metalloproteinase-12 (MMP 12) Matrix metalloproteinase-12 (MMP12) | Matrix metalloproteinases 12 (MMP-12)
Type:
Enzyme
Mol. Mass.:
54012.99
Organism:
Homo sapiens (Human)
Description:
P39900
Residue:
470
  
Inhibitor
Name:
BDBM28482
Synonyms:
(2S)-2-({11-[(methoxycarbonyl)amino]-8-oxatricyclo[7.4.0.0^{2,7}]trideca-1(9),2(7),3,5,10,12-hexaene-5-}sulfonamido)-3-methylbutanoic acid | dibenzofuran (DBF) scaffold, (S)-27
Type:
Small organic molecule
Emp. Form.:
C19H20N2O7S
Mol. Mass.:
420.436
SMILES:
COC(=O)Nc1ccc2c(c1)oc1cc(ccc21)S(=O)(=O)N[C@@H](C(C)C)C(O)=O
: