Target
N-formyl peptide receptor 2
Ligand
BDBM50295521
Substrate
Meas. Tech.
ChEMBL_580002 (CHEMBL1051690)
EC50
8800±n/a nM
Citation
 Cilibrizzi, AQuinn, MTKirpotina, LNSchepetkin, IAHolderness, JYe, RDRabiet, MJBiancalani, CCesari, NGraziano, AVergelli, CPieretti, SDal Piaz, VGiovannoni, MP 6-methyl-2,4-disubstituted pyridazin-3(2H)-ones: a novel class of small-molecule agonists for formyl peptide receptors. J Med Chem 52:5044-57 (2010)  
Target
Name:
N-formyl peptide receptor 2
Synonyms:
ALXR, FPRL1, FPR2 FPR2 FPRH1 Formyl Peptide Receptor-Like 1 LXA4 receptor Lipoxin A4 receptor RFP | hFPRL
Type:
G Protein-Coupled Receptor (GPCR)
Mol. Mass.:
38968.35
Organism:
Homo sapiens (Human)
Description:
P25090
Residue:
351
  
Inhibitor
Name:
BDBM50295521
Synonyms:
2-[5-(3-Methoxybenzyl)-3-methyl-6-oxo-6H-pyridazin-1-yl]-N-(4-trifluoromethylphenyl)-acetamide | CHEMBL549570
Type:
Small organic molecule
Emp. Form.:
C22H20F3N3O3
Mol. Mass.:
431.4077
SMILES:
COc1cccc(Cc2cc(C)nn(CC(=O)Nc3ccc(cc3)C(F)(F)F)c2=O)c1
: