Target
Glutathione S-transferase A1
Ligand
BDBM50295556
Substrate
Meas. Tech.
ChEMBL_579784 (CHEMBL1059685)
Ki
8100±n/a nM
Citation
 Axarli, ILabrou, NEPetrou, CRassias, NCordopatis, PClonis, YD Sulphonamide-based bombesin prodrug analogues for glutathione transferase, useful in targeted cancer chemotherapy. Eur J Med Chem 44:2009-16 (2009)  
Target
Name:
Glutathione S-transferase A1
Synonyms:
GST class-alpha member 1 GSTA1 GSTA1_HUMAN Glutathione S-transferase (GST) | HA subunit 1
Type:
Enzyme
Mol. Mass.:
25636.31
Organism:
Homo sapiens (Human)
Description:
Glutathione-S-Transferase (GST, N-terminally)
Residue:
222
  
Inhibitor
Name:
BDBM50295556
Synonyms:
C6H5-SO2-Glu-Gln-Arg-Leu-Gly-Asn-Gln-Trp-Ala-Val-Gly-His-Leu-Met-NH2 | CHEMBL557211
Type:
Small organic molecule
Emp. Form.:
C77H116N24O21S2
Mol. Mass.:
1778.023
SMILES:
CSCC[C@H](NC(=O)[C@H](CC(C)C)NC(=O)[C@H](Cc1cnc[nH]1)NC(=O)CNC(=O)[C@@H](NC(=O)[C@H](C)NC(=O)[C@H](Cc1c[nH]c2ccccc12)NC(=O)[C@H](CCC(N)=O)NC(=O)[C@H](CC(N)=O)NC(=O)CNC(=O)[C@H](CC(C)C)NC(=O)[C@H](CCCN=C(N)N)NC(=O)[C@H](CCC(N)=O)NC(=O)[C@H](CCC(O)=O)NS(=O)(=O)c1ccccc1)C(C)C)C(N)=O
: