Target
Coagulation factor X
Ligand
BDBM50295590
Substrate
Meas. Tech.
ChEMBL_577597 (CHEMBL1059506)
Ki
20±n/a nM
Citation
 Zbinden, KGAnselm, LBanner, DWBenz, JBlasco, FDécoret, GHimber, JKuhn, BPanday, NRicklin, FRisch, PSchlatter, DStahl, MThomi, SUnger, RHaap, W Design of novel aminopyrrolidine factor Xa inhibitors from a screening hit. Eur J Med Chem 44:2787-95 (2009)  
Target
Name:
Coagulation factor X
Synonyms:
Activated coagulation factor X (FXa) Coagulation factor X precursor F10 Factor X heavy chain Factor Xa Stuart-Prower factor
Type:
Enzyme
Mol. Mass.:
54726.60
Organism:
Homo sapiens (Human)
Description:
Residue:
488
  
Inhibitor
Name:
BDBM50295590
Synonyms:
5-chloro-N-((3S,4S)-4-(2,2-difluoroethoxy)-1-(2-(2-fluoro-4-(2-oxopyridin-1(2H)-yl)phenylamino)-2-oxoethyl)pyrrolidin-3-yl)thiophene-2-carboxamide | CHEMBL558437
Type:
Small organic molecule
Emp. Form.:
C24H22ClF3N4O4S
Mol. Mass.:
554.969
SMILES:
FC(F)CO[C@H]1CN(CC(=O)Nc2ccc(cc2F)-n2ccccc2=O)C[C@@H]1NC(=O)c1ccc(Cl)s1
: