Target
Histamine H1 receptor
Ligand
BDBM50295708
Substrate
Meas. Tech.
ChEMBL_577960 (CHEMBL1059633)
IC50
23±n/a nM
Citation
 Kubota, KKurebayashi, HMiyachi, HTobe, MOnishi, MIsobe, Y Synthesis and structure-activity relationships of phenothiazine carboxylic acids having pyrimidine-dione as novel histamine H(1) antagonists. Bioorg Med Chem Lett 19:2766-71 (2009)  
Target
Name:
Histamine H1 receptor
Synonyms:
H1R HISTAMINE H1 HRH1_HUMAN
Type:
G Protein-Coupled Receptor (GPCR)
Mol. Mass.:
55808.72
Organism:
Homo sapiens (Human)
Description:
Cell pellets from SK-N-MC cells transfected with human H1 receptor were used in binding assay.
Residue:
487
  
Inhibitor
Name:
BDBM50295708
Synonyms:
2-(10-(3-(4-(1,3-dimethyl-2,6-dioxo-1,2,3,6-tetrahydropyrimidin-4-yl)-1,4-diazepan-1-yl)propyl)-10H-phenothiazin-2-yl)acetic acid | CHEMBL559665
Type:
Small organic molecule
Emp. Form.:
C28H33N5O4S
Mol. Mass.:
535.658
SMILES:
Cn1c(cc(=O)n(C)c1=O)N1CCCN(CCCN2c3ccccc3Sc3ccc(CC(O)=O)cc23)CC1
: