Target
Heat shock factor protein 1
Ligand
BDBM50295795
Substrate
Meas. Tech.
ChEMBL_578167 (CHEMBL1060467)
EC50
42900±n/a nM
Citation
 Zhou, YVu, KChen, YPham, JBrady, TLiu, GChen, JNam, JMurali Mohan Reddy, PSAu, QYoon, ISTremblay, MHYip, GCher, CZhang, BBarber, JRNg, SC Chloro-oxime derivatives as novel small molecule chaperone amplifiers. Bioorg Med Chem Lett 19:3128-35 (2009)  
Target
Name:
Heat shock factor protein 1
Synonyms:
HSF1 HSTF1
Type:
PROTEIN
Mol. Mass.:
57244.20
Organism:
Homo sapiens (Human)
Description:
ChEMBL_1512556
Residue:
529
  
Inhibitor
Name:
BDBM50295795
Synonyms:
5-(ethylsulfonyl)-N-(2-hydroxy-3-(piperidin-1-yl)propoxy)benzo[d]oxazole-2-carbimidoyl chloride | CHEMBL561378
Type:
Small organic molecule
Emp. Form.:
C18H24ClN3O5S
Mol. Mass.:
429.918
SMILES:
CCS(=O)(=O)c1ccc2oc(nc2c1)C(\Cl)=N\OCC(O)CN1CCCCC1
: