Target
Heat shock factor protein 1
Ligand
BDBM50295799
Substrate
Meas. Tech.
ChEMBL_578167 (CHEMBL1060467)
EC50
41600±n/a nM
Citation
 Zhou, YVu, KChen, YPham, JBrady, TLiu, GChen, JNam, JMurali Mohan Reddy, PSAu, QYoon, ISTremblay, MHYip, GCher, CZhang, BBarber, JRNg, SC Chloro-oxime derivatives as novel small molecule chaperone amplifiers. Bioorg Med Chem Lett 19:3128-35 (2009)  
Target
Name:
Heat shock factor protein 1
Synonyms:
HSF1 HSTF1
Type:
PROTEIN
Mol. Mass.:
57244.20
Organism:
Homo sapiens (Human)
Description:
ChEMBL_1512556
Residue:
529
  
Inhibitor
Name:
BDBM50295799
Synonyms:
CHEMBL564701 | N-(2-hydroxy-3-(piperidin-1-yl)propoxy)-5-methylbenzo[d]oxazole-2-carbimidoyl chloride
Type:
Small organic molecule
Emp. Form.:
C17H22ClN3O3
Mol. Mass.:
351.828
SMILES:
Cc1ccc2oc(nc2c1)C(\Cl)=N\OCC(O)CN1CCCCC1
: