Target
Heat shock factor protein 1
Ligand
BDBM50295803
Substrate
Meas. Tech.
ChEMBL_578167 (CHEMBL1060467)
EC50
51300±n/a nM
Citation
 Zhou, YVu, KChen, YPham, JBrady, TLiu, GChen, JNam, JMurali Mohan Reddy, PSAu, QYoon, ISTremblay, MHYip, GCher, CZhang, BBarber, JRNg, SC Chloro-oxime derivatives as novel small molecule chaperone amplifiers. Bioorg Med Chem Lett 19:3128-35 (2009)  
Target
Name:
Heat shock factor protein 1
Synonyms:
HSF1 HSTF1
Type:
PROTEIN
Mol. Mass.:
57244.20
Organism:
Homo sapiens (Human)
Description:
ChEMBL_1512556
Residue:
529
  
Inhibitor
Name:
BDBM50295803
Synonyms:
5-fluoro-N-(2-hydroxy-3-(piperidin-1-yl)propoxy)benzo[d]oxazole-2-carbimidoyl chloride | CHEMBL570768
Type:
Small organic molecule
Emp. Form.:
C16H19ClFN3O3
Mol. Mass.:
355.792
SMILES:
OC(CO\N=C(/Cl)c1nc2cc(F)ccc2o1)CN1CCCCC1
: