Target
Neuronal acetylcholine receptor subunit alpha-2
Ligand
BDBM50295954
Substrate
Meas. Tech.
ChEMBL_578993 (CHEMBL1061442)
Ki
11±n/a nM
Citation
 Gao, YRavert, HTKuwabara, HXiao, YEndres, CJHilton, JHolt, DPKumar, AAlexander, MWong, DFDannals, RFHorti, AG Synthesis and biological evaluation of novel carbon-11 labeled pyridyl ethers: candidate ligands for in vivo imaging of alpha4beta2 nicotinic acetylcholine receptors (alpha4beta2-nAChRs) in the brain with positron emission tomography. Bioorg Med Chem 17:4367-77 (2009)  
Target
Name:
Neuronal acetylcholine receptor subunit alpha-2
Synonyms:
ACHA2_RAT Cholinergic, Nicotinic Alpha2Beta2 Chrna2
Type:
Enzyme
Mol. Mass.:
58597.25
Organism:
Rattus norvegicus (Rat)
Description:
P12389
Residue:
511
  
Inhibitor
Name:
BDBM50295954
Synonyms:
2-Chloro-3-(2-fluoro-4-(pyridinyl)methoxy)-5-((1-methyl-2-(S)-pyrrolidinyl)methoxy)pyridine | CHEMBL563479
Type:
Small organic molecule
Emp. Form.:
C17H19ClFN3O2
Mol. Mass.:
351.803
SMILES:
CN1CCC[C@H]1COc1cnc(Cl)c(OCc2ccnc(F)c2)c1
: