Target
Neuronal acetylcholine receptor subunit alpha-4
Ligand
BDBM50295956
Substrate
Meas. Tech.
ChEMBL_578996 (CHEMBL1061445)
Ki
0.055±n/a nM
Citation
 Gao, YRavert, HTKuwabara, HXiao, YEndres, CJHilton, JHolt, DPKumar, AAlexander, MWong, DFDannals, RFHorti, AG Synthesis and biological evaluation of novel carbon-11 labeled pyridyl ethers: candidate ligands for in vivo imaging of alpha4beta2 nicotinic acetylcholine receptors (alpha4beta2-nAChRs) in the brain with positron emission tomography. Bioorg Med Chem 17:4367-77 (2009)  
Target
Name:
Neuronal acetylcholine receptor subunit alpha-4
Synonyms:
ACHA4_RAT Cholinergic, Nicotinic Alpha4Beta2 Chrna4 Neuronal acetylcholine receptor (alpha4beta2 nAChR) Neuronal acetylcholine receptor subunit alpha 4 beta 2 | Neuronal acetylcholine receptor subunit alpha-4
Type:
Enzyme
Mol. Mass.:
70196.44
Organism:
Rattus norvegicus (Rat)
Description:
P09483
Residue:
630
  
Inhibitor
Name:
BDBM50295956
Synonyms:
2-Chloro-3-(2-chloro-5-(pyridinyl)methoxy)-5-((1-methyl)-2-(S)-pyrrolidinyl)methoxy)pyridine | CHEMBL563831
Type:
Small organic molecule
Emp. Form.:
C17H19Cl2N3O2
Mol. Mass.:
368.258
SMILES:
CN1CCC[C@H]1COc1cnc(Cl)c(OCc2ccc(Cl)nc2)c1
: