Target
Heat shock factor protein 1
Ligand
BDBM50296057
Substrate
Meas. Tech.
ChEMBL_579378 (CHEMBL1063219)
EC50
35000±n/a nM
Citation
 Zhou, YWei, LBrady, TPMurali Mohan Redddy, PSNguyen, TChen, JAu, QYoon, ISYip, GZhang, BBarber, JRNg, SC Pyrimido[5,4-e][1,2,4]triazine-5,7(1H,6H)-dione derivatives as novel small molecule chaperone amplifiers. Bioorg Med Chem Lett 19:4303-7 (2009)  
Target
Name:
Heat shock factor protein 1
Synonyms:
HSF1 HSTF1
Type:
PROTEIN
Mol. Mass.:
57244.20
Organism:
Homo sapiens (Human)
Description:
ChEMBL_1512556
Residue:
529
  
Inhibitor
Name:
BDBM50296057
Synonyms:
1-ethyl-6-methyl-3-(1H-pyrrol-2-yl)pyrimido[5,4-e][1,2,4]triazine-5,7(1H,6H)-dione | CHEMBL541255
Type:
Small organic molecule
Emp. Form.:
C12H12N6O2
Mol. Mass.:
272.2627
SMILES:
CCn1nc(nc2c1nc(=O)n(C)c2=O)-c1ccc[nH]1
: