Target
Heat shock factor protein 1
Ligand
BDBM50296063
Substrate
Meas. Tech.
ChEMBL_579378 (CHEMBL1063219)
EC50
40800±n/a nM
Citation
 Zhou, YWei, LBrady, TPMurali Mohan Redddy, PSNguyen, TChen, JAu, QYoon, ISYip, GZhang, BBarber, JRNg, SC Pyrimido[5,4-e][1,2,4]triazine-5,7(1H,6H)-dione derivatives as novel small molecule chaperone amplifiers. Bioorg Med Chem Lett 19:4303-7 (2009)  
Target
Name:
Heat shock factor protein 1
Synonyms:
HSF1 HSTF1
Type:
PROTEIN
Mol. Mass.:
57244.20
Organism:
Homo sapiens (Human)
Description:
ChEMBL_1512556
Residue:
529
  
Inhibitor
Name:
BDBM50296063
Synonyms:
3-(1H-benzo[d]imidazol-2-yl)-1-butyl-6-methylpyrimido[5,4-e][1,2,4]triazine-5,7(1H,6H)-dione | CHEMBL557716
Type:
Small organic molecule
Emp. Form.:
C17H17N7O2
Mol. Mass.:
351.3626
SMILES:
CCCCn1nc(nc2c1nc(=O)n(C)c2=O)-c1nc2ccccc2[nH]1
: