Target
Bifunctional epoxide hydrolase 2
Ligand
BDBM50296217
Substrate
Meas. Tech.
ChEMBL_579572 (CHEMBL1062360)
IC50
156±n/a nM
Citation
 Anandan, SKWebb, HKDo, ZNGless, RD Unsymmetrical non-adamantyl N,N'-diaryl urea and amide inhibitors of soluble expoxide hydrolase. Bioorg Med Chem Lett 19:4259-63 (2009)  
Target
Name:
Bifunctional epoxide hydrolase 2
Synonyms:
Cytosolic epoxide hydrolase 2 EPHX2 HYES_HUMAN Soluble epoxide hydrolase (sEH) | epoxide hydrolase 2, cytoplasmic
Type:
Enzyme
Mol. Mass.:
62613.07
Organism:
Homo sapiens (Human)
Description:
P34913
Residue:
555
  
Inhibitor
Name:
BDBM50296217
Synonyms:
CHEMBL564986 | N-(4-fluoro-3-(3-morpholinopropoxy)phenyl)-2-(4-(trifluoromethyl)phenyl)acetamide
Type:
Small organic molecule
Emp. Form.:
C22H24F4N2O3
Mol. Mass.:
440.4312
SMILES:
Fc1ccc(NC(=O)Cc2ccc(cc2)C(F)(F)F)cc1OCCCN1CCOCC1
: