Target
Matrix metalloproteinase-14
Ligand
BDBM50296240
Substrate
Meas. Tech.
ChEMBL_579664 (CHEMBL1064084)
IC50
52000±n/a nM
Citation
 Aihara, YYoshida, AFuruta, TWakimoto, TAkizawa, TKonishi, MKan, T Regioselective synthesis of methylated epigallocatechin gallate via nitrobenzenesulfonyl (Ns) protecting group. Bioorg Med Chem Lett 19:4171-4 (2009)  
Target
Name:
Matrix metalloproteinase-14
Synonyms:
MMP-14 MMP14 MT-MMP 1 MT1MMP Matrix Metalloproteinase-14 (MMP-14) Matrix metalloproteinase-14 Membrane-type matrix metalloproteinase 1 | Membrane-type-1 matrix metalloproteinase
Type:
Protein
Mol. Mass.:
65900.19
Organism:
Homo sapiens (Human)
Description:
P50281
Residue:
582
  
Inhibitor
Name:
BDBM50296240
Synonyms:
(2R,3S)-2-(3,4-dihydroxyphenyl)-5,7-dihydroxychroman-3-yl 3,4-dihydroxy-5-methoxybenzoate | CHEMBL556277
Type:
Small organic molecule
Emp. Form.:
C23H20O10
Mol. Mass.:
456.3989
SMILES:
COc1cc(cc(O)c1O)C(=O)O[C@H]1Cc2c(O)cc(O)cc2O[C@@H]1c1ccc(O)c(O)c1
: