Target
72 kDa type IV collagenase
Ligand
BDBM50296236
Substrate
Meas. Tech.
ChEMBL_579666 (CHEMBL1064086)
IC50
88000±n/a nM
Citation
 Aihara, YYoshida, AFuruta, TWakimoto, TAkizawa, TKonishi, MKan, T Regioselective synthesis of methylated epigallocatechin gallate via nitrobenzenesulfonyl (Ns) protecting group. Bioorg Med Chem Lett 19:4171-4 (2009)  
Target
Name:
72 kDa type IV collagenase
Synonyms:
72 kDa gelatinase CLG4A Gelatinase A (MMP-2) MMP2_HUMAN Matrix metalloproteinase-2 (MMP 2) Matrix metalloproteinases 2 (MMP-2) | TBE-1
Type:
Enzyme
Mol. Mass.:
73870.36
Organism:
Homo sapiens (Human)
Description:
P08253
Residue:
660
  
Inhibitor
Name:
BDBM50296236
Synonyms:
(2R,3R)-2-(3,4-dihydroxyphenyl)-5,7-dihydroxychroman-3-yl 3,4-dihydroxy-5-methoxybenzoate CHEMBL158521
Type:
Small organic molecule
Emp. Form.:
C23H20O10
Mol. Mass.:
456.3989
SMILES:
COc1cc(cc(O)c1O)C(=O)O[C@@H]1Cc2c(O)cc(O)cc2O[C@@H]1c1ccc(O)c(O)c1
: