Target
Matrilysin
Ligand
BDBM50296237
Substrate
Meas. Tech.
ChEMBL_579665 (CHEMBL1064085)
IC50
>100000±n/a nM
Citation
 Aihara, YYoshida, AFuruta, TWakimoto, TAkizawa, TKonishi, MKan, T Regioselective synthesis of methylated epigallocatechin gallate via nitrobenzenesulfonyl (Ns) protecting group. Bioorg Med Chem Lett 19:4171-4 (2009)  
Target
Name:
Matrilysin
Synonyms:
MMP7 MPSL1 Matrix metalloproteinase-7 (MMP-7) PUMP1
Type:
Enzyme
Mol. Mass.:
29681.54
Organism:
Homo sapiens (Human)
Description:
P09237
Residue:
267
  
Inhibitor
Name:
BDBM50296237
Synonyms:
(2R,3R)-2-(3,4-Dihydroxyphenyl)-5,7-dihydroxychroman-3-yl 3,5-dihydroxy-4-methoxybenzoate CHEMBL159433
Type:
Small organic molecule
Emp. Form.:
C23H20O10
Mol. Mass.:
456.3989
SMILES:
COc1c(O)cc(cc1O)C(=O)O[C@@H]1Cc2c(O)cc(O)cc2O[C@@H]1c1ccc(O)c(O)c1
: