Target
Tyrosinase
Ligand
BDBM50031467
Substrate
Meas. Tech.
ChEMBL_579676 (CHEMBL1064096)
IC50
61000±n/a nM
Citation
 Yamazaki, YKawano, YYamanaka, AMaruyama, S N-[(Dihydroxyphenyl)acyl]serotonins as potent inhibitors of tyrosinase from mouse and human melanoma cells. Bioorg Med Chem Lett 19:4178-82 (2009)  
Target
Name:
Tyrosinase
Synonyms:
TYRO_MOUSE | Tyr
Type:
Protein
Mol. Mass.:
60600.74
Organism:
Mus musculus (Mouse)
Description:
Residue:
533
  
Inhibitor
Name:
BDBM50031467
Synonyms:
5-HYDROXY-2-(HYDROXYMETHYL)-4H-PYRAN-4-ONE CHEMBL287556 US10857082, Kojic acid US9682910, kojic acid
Type:
Small organic molecule
Emp. Form.:
C6H6O4
Mol. Mass.:
142.1094
SMILES:
OCc1cc(=O)c(O)co1
: