Target
cGMP-specific 3',5'-cyclic phosphodiesterase
Ligand
BDBM50296254
Substrate
Meas. Tech.
ChEMBL_579817 (CHEMBL1059718)
IC50
1.2±n/a nM
Citation
 Hughes, ROWalker, JKCubbage, JWFobian, YMRogier, DJHeasley, SEBlevis-Bal, RMBenson, AGOwen, DRJacobsen, EJFreskos, JNMolyneaux, JMBrown, DLStallings, WCAcker, BAMaddux, TMTollefson, MBWilliams, JMMoon, JBMischke, BVRumsey, JMZheng, YMacinnes, ABond, BRYu, Y Investigation of aminopyridiopyrazinones as PDE5 inhibitors: Evaluation of modifications to the central ring system. Bioorg Med Chem Lett 19:4092-6 (2009)  
Target
Name:
cGMP-specific 3',5'-cyclic phosphodiesterase
Synonyms:
3',5'-cyclic phosphodiesterase PDE5 PDE5A_HUMAN Phosphodiesterase 5 (PDE5) Phosphodiesterase 5A (PDE5A) cGMP-specific 3',5'-cyclic phosphodiesterase
Type:
Protein
Mol. Mass.:
99975.83
Organism:
Homo sapiens (Human)
Description:
O76074
Residue:
875
  
Inhibitor
Name:
BDBM50296254
Synonyms:
2-(6-methoxypyridin-3-yl)-6-(2-morpholinoethylamino)-8-(2-propoxyethyl)pteridin-7(8H)-one | CHEMBL550851
Type:
Small organic molecule
Emp. Form.:
C23H31N7O4
Mol. Mass.:
469.5367
SMILES:
CCCOCCn1c2nc(ncc2nc(NCCN2CCOCC2)c1=O)-c1ccc(OC)nc1
: