Target
Receptor-type tyrosine-protein phosphatase F
Ligand
BDBM50296372
Substrate
Meas. Tech.
ChEMBL_580554 (CHEMBL1054000)
IC50
624.7±n/a nM
Citation
 Lakshminarayana, NRajendra Prasad, YGharat, LThomas, ARavikumar, PNarayanan, SSrinivasan, CVGopalan, B Synthesis and evaluation of some novel isochroman carboxylic acid derivatives as potential anti-diabetic agents. Eur J Med Chem 44:3147-57 (2009)  
Target
Name:
Receptor-type tyrosine-protein phosphatase F
Synonyms:
LAR Leukocyte common antigen related (LAR) PTPRF_HUMAN Receptor-type tyrosine-protein phosphatase F (LAR)
Type:
Protein
Mol. Mass.:
212869.85
Organism:
Homo sapiens (Human)
Description:
P10586
Residue:
1907
  
Inhibitor
Name:
BDBM50296372
Synonyms:
(3S)-7-[3-(2-Thienyl)propylcarboxamido]-isochroman-3-carboxylic acid | CHEMBL550662
Type:
Small organic molecule
Emp. Form.:
C18H19NO4S
Mol. Mass.:
345.413
SMILES:
OC(=O)[C@@H]1Cc2ccc(NC(=O)CCCc3cccs3)cc2CO1
: