Target
Carboxypeptidase B
Ligand
BDBM50296413
Substrate
Meas. Tech.
ChEMBL_580786 (CHEMBL1059768)
Ki
1200±n/a nM
Citation
 Fernández, DAvilés, FXVendrell, J A new type of five-membered heterocyclic inhibitors of basic metallocarboxypeptidases. Eur J Med Chem 44:3266-71 (2009)  
Target
Name:
Carboxypeptidase B
Synonyms:
CPB
Type:
Enzyme
Mol. Mass.:
48382.46
Organism:
Helicoverpa zea (Corn earworm moth) (Heliothis zea)
Description:
Q3T905
Residue:
429
  
Inhibitor
Name:
BDBM50296413
Synonyms:
CHEMBL551268 | N-benzyl-N-(4-phenylthiazol-2-yl)cyclopropanecarboxamide
Type:
Small organic molecule
Emp. Form.:
C20H18N2OS
Mol. Mass.:
334.435
SMILES:
O=C(C1CC1)N(Cc1ccccc1)c1nc(cs1)-c1ccccc1
: