Target
Carboxypeptidase B
Ligand
BDBM50296426
Substrate
Meas. Tech.
ChEMBL_580862 (CHEMBL1064194)
Ki
23000±n/a nM
Citation
 Fernández, DAvilés, FXVendrell, J A new type of five-membered heterocyclic inhibitors of basic metallocarboxypeptidases. Eur J Med Chem 44:3266-71 (2009)  
Target
Name:
Carboxypeptidase B
Synonyms:
CBPB1_HUMAN CPB1 PASP Pancreas-specific protein | Thrombin-activatable fibrinolysis (TAFI)
Type:
Enzyme
Mol. Mass.:
47367.43
Organism:
Homo sapiens (Human)
Description:
P15086
Residue:
417
  
Inhibitor
Name:
BDBM50296426
Synonyms:
CHEMBL563098 | N1-benzyl-N4-((tetrahydrofuran-2-yl)methyl)-N4-(thiophen-2-ylmethyl)benzene-1,4-disulfonamide
Type:
Small organic molecule
Emp. Form.:
C23H26N2O5S3
Mol. Mass.:
506.658
SMILES:
O=S(=O)(NCc1ccccc1)c1ccc(cc1)S(=O)(=O)N(CC1CCCO1)Cc1cccs1
: