Target
Nitric oxide synthase, brain
Ligand
BDBM50414552
Substrate
Meas. Tech.
ChEMBL_581707 (CHEMBL1058905)
IC50
5800±n/a nM
Citation
 Tapiolas, DMBowden, BFAbou-Mansour, EWillis, RHDoyle, JRMuirhead, ANLiptrot, CLlewellyn, LEWolff, CWWright, ADMotti, CA Eusynstyelamides A, B, and C, nNOS inhibitors, from the ascidian Eusynstyela latericius. J Nat Prod 72:1115-20 (2009)  
Target
Name:
Nitric oxide synthase, brain
Synonyms:
Bnos NC-NOS NOS type I nNOS Neuronal nitric oxide synthase Nitric Oxide Synthase, brain Nitric oxide synthase, brain (nNOS) Nitric-oxide synthase, brain (nNOS) Nos1 | Peptidyl-cysteine S-nitrosylase NOS1
Type:
Enzyme
Mol. Mass.:
160570.98
Organism:
Rattus norvegicus (rat)
Description:
Recombinant nNOS overexpressed in E. coli was used in enzyme assays.
Residue:
1429
  
Inhibitor
Name:
BDBM50414552
Synonyms:
CHEMBL2021548
Type:
Small organic molecule
Emp. Form.:
C33H42Br2N10O4
Mol. Mass.:
802.559
SMILES:
NC(N)=NCCCCNC(=O)[C@@]1(O)[C@H](Cc2c[nH]c3cc(Br)ccc23)[C@](O)(Cc2c[nH]c3cc(Br)ccc23)C(=O)N1CCCCN=C(N)N
: