Target
Stearoyl-CoA desaturase
Ligand
BDBM50296529
Substrate
Meas. Tech.
ChEMBL_582073 (CHEMBL1060792)
IC50
2±n/a nM
Citation
 Uto, YOgata, THarada, JKiyotsuka, YUeno, YMiyazawa, YKurata, HDeguchi, TWatanabe, NTakagi, TWakimoto, SOkuyama, RAbe, MKurikawa, NKawamura, SYamato, MOsumi, J Novel and potent inhibitors of stearoyl-CoA desaturase-1. Part I: Discovery of 3-(2-hydroxyethoxy)-4-methoxy-N-[5-(3-trifluoromethylbenzyl)thiazol-2-yl]benzamide. Bioorg Med Chem Lett 19:4151-8 (2009)  
Target
Name:
Stearoyl-CoA desaturase
Synonyms:
Acyl-CoA desaturase SCD SCDOS Stearoyl-CoA (SCD1) | Stearoyl-CoA desaturase 1
Type:
Enzyme
Mol. Mass.:
41537.27
Organism:
Homo sapiens (Human)
Description:
O00767
Residue:
359
  
Inhibitor
Name:
BDBM50296529
Synonyms:
CHEMBL552270 | N-(5-(3-chloro-4-fluorobenzyl)thiazol-2-yl)-3-(2-hydroxyethoxy)-4-methoxybenzamide
Type:
Small organic molecule
Emp. Form.:
C20H18ClFN2O4S
Mol. Mass.:
436.884
SMILES:
COc1ccc(cc1OCCO)C(=O)Nc1ncc(Cc2ccc(F)c(Cl)c2)s1
: