Target
Acid-sensing ion channel 3
Ligand
BDBM50296575
Substrate
Meas. Tech.
ChEMBL_582093 (CHEMBL1061604)
IC50
77000±n/a nM
Citation
 Kuduk, SDChang, RKWai, JMDi Marco, CNCofre, VDiPardo, RMCook, SPCato, MJJovanovska, AUrban, MOLeitl, MSpencer, RHKane, SAHartman, GDBilodeau, MT Amidine derived inhibitors of acid-sensing ion channel-3 (ASIC3). Bioorg Med Chem Lett 19:4059-63 (2009)  
Target
Name:
Acid-sensing ion channel 3
Synonyms:
ACCN3 ASIC3_HUMAN SLNAC1 | TNAC1
Type:
PROTEIN
Mol. Mass.:
58910.26
Organism:
Homo sapiens (Human)
Description:
ChEMBL_757561
Residue:
531
  
Inhibitor
Name:
BDBM50296575
Synonyms:
2-(3-(benzylamino)-5-chlorophenyl)-1H-indole-5-carboximidamide | CHEMBL561796
Type:
Small organic molecule
Emp. Form.:
C22H19ClN4
Mol. Mass.:
374.866
SMILES:
NC(=N)c1ccc2[nH]c(cc2c1)-c1cc(Cl)cc(NCc2ccccc2)c1
: