Target
Cytochrome P450 1A2
Ligand
BDBM50296636
Substrate
Meas. Tech.
ChEMBL_582364 (CHEMBL1063401)
IC50
>30000±n/a nM
Citation
 Wurz, RPPettus, LHXu, SHenkle, BSherman, LPlant, MMiner, KMcBride, HWong, LMSaris, CJLee, MRChmait, SMohr, CHsieh, FTasker, AS Part 1: Structure-Activity Relationship (SAR) investigations of fused pyrazoles as potent, selective and orally available inhibitors of p38alpha mitogen-activated protein kinase. Bioorg Med Chem Lett 19:4724-8 (2009)  
Target
Name:
Cytochrome P450 1A2
Synonyms:
CP1A2_HUMAN CYPIA2 Cytochrome P(3)450 Cytochrome P450 1A2 (CYP1A2) Cytochrome P450-P3
Type:
Enzyme
Mol. Mass.:
58423.38
Organism:
Homo sapiens (Human)
Description:
P05177
Residue:
516
  
Inhibitor
Name:
BDBM50296636
Synonyms:
4-chloro-N-cyclopropyl-3-(1-(4-fluorophenyl)-7-methyl-6-oxo-6,7-dihydro-1H-pyrazolo[3,4-b]pyridin-4-ylamino)benzamide | CHEMBL561932
Type:
Small organic molecule
Emp. Form.:
C23H19ClFN5O2
Mol. Mass.:
451.881
SMILES:
Cn1c2n(ncc2c(Nc2cc(ccc2Cl)C(=O)NC2CC2)cc1=O)-c1ccc(F)cc1
: