Target
Dipeptidyl peptidase 4
Ligand
BDBM50296760
Substrate
Meas. Tech.
ChEMBL_582502 (CHEMBL1060835)
IC50
6.8±n/a nM
Citation
 Nordhoff, SLópez-Canet, MHoffmann-Enger, BBulat, SCerezo-Gálvez, SHill, ORosenbaum, CRummey, CThiemann, MMatassa, VGEdwards, PJFeurer, A From lead to preclinical candidate: optimization of beta-homophenylalanine based inhibitors of dipeptidyl peptidase IV. Bioorg Med Chem Lett 19:4818-23 (2009)  
Target
Name:
Dipeptidyl peptidase 4
Synonyms:
ADABP Adenosine deaminase complexing protein 2 CD_antigen=CD26 DPP4 DPPIV Dipeptidyl peptidase 4 (DPP IV) Dipeptidyl peptidase 4 (DPP4) Dipeptidyl peptidase 4 membrane form Dipeptidyl peptidase IV Dipeptidyl peptidase IV (DDP-IV) Dipeptidyl peptidase IV membrane form Dipeptidyl peptidase-IV (DPP-4) T-cell activation antigen CD26 | TP103
Type:
Enzyme
Mol. Mass.:
88271.01
Organism:
Homo sapiens (Human)
Description:
P27487
Residue:
766
  
Inhibitor
Name:
BDBM50296760
Synonyms:
CHEMBL550321 | N-(((S)-1-((R)-3-amino-4-(2,4,5-trifluorophenyl)butanoyl)pyrrolidin-2-yl)methyl)-N-methylpivalamide
Type:
Small organic molecule
Emp. Form.:
C21H30F3N3O2
Mol. Mass.:
413.477
SMILES:
CN(C[C@@H]1CCCN1C(=O)C[C@H](N)Cc1cc(F)c(F)cc1F)C(=O)C(C)(C)C
: