Target
Neutrophil elastase
Ligand
BDBM50296811
Substrate
Meas. Tech.
ChEMBL_582553 (CHEMBL1061649)
IC50
64±n/a nM
Citation
 Shreder, KRCajica, JDu, LFraser, AHu, YKohno, YLin, ECLiu, SJOkerberg, EPham, LWu, JKozarich, JW Synthesis and optimization of 2-pyridin-3-yl-benzo[d][1,3]oxazin-4-one based inhibitors of human neutrophil elastase. Bioorg Med Chem Lett 19:4743-6 (2009)  
Target
Name:
Neutrophil elastase
Synonyms:
Bone marrow serine protease Coagulation factor X ELANE Elastase HLE Leukocyte elastase Medullasin Neutrophil elastase (HNE) PMN elastase Trypsin
Type:
Enzyme
Mol. Mass.:
28532.38
Organism:
Homo sapiens (Human)
Description:
P08246
Residue:
267
  
Inhibitor
Name:
BDBM50296811
Synonyms:
2-(2-(1H-imidazol-1-yl)pyridin-3-yl)-5-methyl-4H-benzo[d][1,3]oxazin-4-one | CHEMBL554978
Type:
Small organic molecule
Emp. Form.:
C17H12N4O2
Mol. Mass.:
304.3028
SMILES:
Cc1cccc2nc(oc(=O)c12)-c1cccnc1-n1ccnc1
: