Target
Neutrophil elastase
Ligand
BDBM50296837
Substrate
Meas. Tech.
ChEMBL_582553 (CHEMBL1061649)
IC50
850±n/a nM
Citation
 Shreder, KRCajica, JDu, LFraser, AHu, YKohno, YLin, ECLiu, SJOkerberg, EPham, LWu, JKozarich, JW Synthesis and optimization of 2-pyridin-3-yl-benzo[d][1,3]oxazin-4-one based inhibitors of human neutrophil elastase. Bioorg Med Chem Lett 19:4743-6 (2009)  
Target
Name:
Neutrophil elastase
Synonyms:
Bone marrow serine protease Coagulation factor X ELANE Elastase HLE Leukocyte elastase Medullasin Neutrophil elastase (HNE) PMN elastase Trypsin
Type:
Enzyme
Mol. Mass.:
28532.38
Organism:
Homo sapiens (Human)
Description:
P08246
Residue:
267
  
Inhibitor
Name:
BDBM50296837
Synonyms:
5-cyclobutyl-7-methoxy-2-(2-(4-(1-methylpiperidin-4-yl)piperazin-1-yl)pyridin-3-yl)-4H-benzo[d][1,3]oxazin-4-one | CHEMBL559678
Type:
Small organic molecule
Emp. Form.:
C28H35N5O3
Mol. Mass.:
489.6092
SMILES:
COc1cc(C2CCC2)c2c(c1)nc(oc2=O)-c1cccnc1N1CCN(CC1)C1CCN(C)CC1
: