Target
Prostaglandin D2 receptor 2
Ligand
BDBM50296850
Substrate
Meas. Tech.
ChEMBL_582698 (CHEMBL1051072)
IC50
101±n/a nM
Citation
 Sandham, DAAdcock, CBala, KBarker, LBrown, ZDubois, GBudd, DCox, BFairhurst, RAFuregati, MLeblanc, CManini, JProfit, RReilly, JStringer, RSchmidt, ATurner, KLWatson, SJWillis, JWilliams, GWilson, C 7-Azaindole-3-acetic acid derivatives: potent and selective CRTh2 receptor antagonists. Bioorg Med Chem Lett 19:4794-8 (2009)  
Target
Name:
Prostaglandin D2 receptor 2
Synonyms:
CD_antigen=CD294 Chemoattractant Receptor-homologous molecule expressed on T-helper type 2 cells (CRTH2) Chemoattractant receptor-homologous molecule expressed on Th2 cells (CRTH2) G protein-coupled receptor 44 GPR44 PTGDR2 Prostaglandin D2 receptor 2 | Prostaglandin D2 receptor 2 (PGD2)
Type:
Enzyme
Mol. Mass.:
43295.45
Organism:
Homo sapiens (Human)
Description:
Q9Y5Y4
Residue:
395
  
Inhibitor
Name:
BDBM50296850
Synonyms:
2-(1-(3-cyano-4-fluorophenylsulfonyl)-2-methyl-1H-pyrrolo[2,3-b]pyridin-3-yl)acetic acid | CHEMBL559044
Type:
Small organic molecule
Emp. Form.:
C17H12FN3O4S
Mol. Mass.:
373.358
SMILES:
Cc1c(CC(O)=O)c2cccnc2n1S(=O)(=O)c1ccc(F)c(c1)C#N
: