Target
Thromboxane A2 receptor
Ligand
BDBM50296851
Substrate
Meas. Tech.
ChEMBL_582684 (CHEMBL1051058)
Ki
>10000±n/a nM
Citation
 Sandham, DAAdcock, CBala, KBarker, LBrown, ZDubois, GBudd, DCox, BFairhurst, RAFuregati, MLeblanc, CManini, JProfit, RReilly, JStringer, RSchmidt, ATurner, KLWatson, SJWillis, JWilliams, GWilson, C 7-Azaindole-3-acetic acid derivatives: potent and selective CRTh2 receptor antagonists. Bioorg Med Chem Lett 19:4794-8 (2009)  
Target
Name:
Thromboxane A2 receptor
Synonyms:
Prostanoid TP receptor TBXA2R Thromboxane Thromboxane Beta
Type:
Enyzme
Mol. Mass.:
37445.28
Organism:
Homo sapiens (Human)
Description:
P21731
Residue:
343
  
Inhibitor
Name:
BDBM50296851
Synonyms:
2-(1-(4-chlorophenylsulfonyl)-2-methyl-1H-pyrrolo[2,3-b]pyridin-3-yl)acetic acid | CHEMBL561539
Type:
Small organic molecule
Emp. Form.:
C16H13ClN2O4S
Mol. Mass.:
364.803
SMILES:
Cc1c(CC(O)=O)c2cccnc2n1S(=O)(=O)c1ccc(Cl)cc1
: