Target
Cholecystokinin receptor type A
Ligand
BDBM50296848
Substrate
Meas. Tech.
ChEMBL_582708 (CHEMBL1054970)
IC50
8100±n/a nM
Citation
 Sandham, DAAdcock, CBala, KBarker, LBrown, ZDubois, GBudd, DCox, BFairhurst, RAFuregati, MLeblanc, CManini, JProfit, RReilly, JStringer, RSchmidt, ATurner, KLWatson, SJWillis, JWilliams, GWilson, C 7-Azaindole-3-acetic acid derivatives: potent and selective CRTh2 receptor antagonists. Bioorg Med Chem Lett 19:4794-8 (2009)  
Target
Name:
Cholecystokinin receptor type A
Synonyms:
CCK-A receptor CCK1-R CCKAR_HUMAN Cholecystokinin receptor Cholecystokinin-1 Receptor
Type:
G Protein-Coupled Receptor (GPCR)
Mol. Mass.:
47859.34
Organism:
Homo sapiens (Human)
Description:
Stable expression of human CCK-1 receptors in HEK 293 cells.
Residue:
428
  
Inhibitor
Name:
BDBM50296848
Synonyms:
2-(1-(3,4-difluorophenylsulfonyl)-2-methyl-1H-pyrrolo[2,3-b]pyridin-3-yl)acetic acid | CHEMBL563949
Type:
Small organic molecule
Emp. Form.:
C16H12F2N2O4S
Mol. Mass.:
366.339
SMILES:
Cc1c(CC(O)=O)c2cccnc2n1S(=O)(=O)c1ccc(F)c(F)c1
: