Target
MAP kinase-activated protein kinase 2
Ligand
BDBM50119298
Substrate
Meas. Tech.
ChEMBL_581801 (CHEMBL1063346)
IC50
700±n/a nM
Citation
 Anderson, DRMeyers, MJKurumbail, RGCaspers, NPoda, GILong, SAPierce, BSMahoney, MWMourey, RJ Benzothiophene inhibitors of MK2. Part 1: structure-activity relationships, assessments of selectivity and cellular potency. Bioorg Med Chem Lett 19:4878-81 (2009)  
Target
Name:
MAP kinase-activated protein kinase 2
Synonyms:
MAP kinase-activated protein kinase 2 (MAPKAPK2) MAP kinase-activated protein kinase 2 (p38/MK2) MAPK-activated protein kinase 2 MAPKAP kinase 2 MAPKAPK2 | MK2
Type:
Serine/threonine-protein kinase
Mol. Mass.:
45579.87
Organism:
Homo sapiens (Human)
Description:
P49137
Residue:
400
  
Inhibitor
Name:
BDBM50119298
Synonyms:
(R)-3-Methoxy-7-methyl-5,6,7,8-tetrahydro-10-thia-5,8-diaza-benzo[a]azulen-9-one CHEMBL99780
Type:
Small organic molecule
Emp. Form.:
C13H14N2O2S
Mol. Mass.:
262.327
SMILES:
COc1ccc2sc3c(NC[C@@H](C)NC3=O)c2c1
: