Target
Replicase polyprotein 1ab
Ligand
BDBM50297248
Substrate
Meas. Tech.
ChEMBL_581483 (CHEMBL1055727)
IC50
>50000±n/a nM
Citation
 Lee, CLee, JMLee, NRKim, DEJeong, YJChong, Y Investigation of the pharmacophore space of Severe Acute Respiratory Syndrome coronavirus (SARS-CoV) NTPase/helicase by dihydroxychromone derivatives. Bioorg Med Chem Lett 19:4538-41 (2009)  
Target
Name:
Replicase polyprotein 1ab
Synonyms:
3C-like proteinase 3C-like proteinase (SARS-CoV 3Cpro) 3CLp GFL Guanine-N7 methyltransferase Helicase Leader protein Non-structural protein 10 Non-structural protein 3 Non-structural protein 6 Non-structural protein 8 ORF1ab polyprotein PL2-PRO Pol R1AB_SARS RdRp SARS coronavirus main proteinase nsp1 nsp12 nsp14 nsp16 nsp3 nsp5 nsp7 nsp9 pp1ab | rep
Type:
Protein
Mol. Mass.:
790250.81
Organism:
Human SARS coronavirus (SARS-CoV) (Severe acute respiratory syndrome coronavirus)
Description:
P0C6X7
Residue:
7073
  
Inhibitor
Name:
BDBM50297248
Synonyms:
2-[(4-Chloro-benzylamino)-methyl]-5,6-dihydroxy-chromen-4-one | CHEMBL549646
Type:
Small organic molecule
Emp. Form.:
C17H14ClNO4
Mol. Mass.:
331.75
SMILES:
Oc1cc(CNCc2ccc(Cl)cc2)oc2ccc(O)c(=O)c12
: