Target
Delta-type opioid receptor
Ligand
BDBM50297319
Substrate
Meas. Tech.
ChEMBL_583045 (CHEMBL1056544)
EC50
100±n/a nM
Citation
 Le Bourdonnec, BWindh, RTLeister, LKZhou, QJAjello, CWGu, MChu, GHTuthill, PABarker, WMKoblish, MWiant, DDGraczyk, TMBelanger, SCassel, JAFeschenko, MSBrogdon, BLSmith, SADerelanko, MJKutz, SLittle, PJDeHaven, RNDeHaven-Hudkins, DLDolle, RE Spirocyclic delta opioid receptor agonists for the treatment of pain: discovery of N,N-diethyl-3-hydroxy-4-(spiro[chromene-2,4'-piperidine]-4-yl) benzamide (ADL5747). J Med Chem 52:5685-702 (2009)  
Target
Name:
Delta-type opioid receptor
Synonyms:
D-OR-1 Delta opioid receptor OPIATE Delta OPRD1 OPRK1 | opioid receptor, delta 1
Type:
G Protein-Coupled Receptor (GPCR)
Mol. Mass.:
40382.98
Organism:
Homo sapiens (Human)
Description:
Competition binding assays were carried out using membrane preparations from transfected HN9.10 cells that constitutively expressed the delta opioid receptor.
Residue:
372
  
Inhibitor
Name:
BDBM50297319
Synonyms:
CHEMBL550261 | Piperidin-1-yl(4-(spiro[chromene-2,4'-piperidine]-4-yl)phenyl)methanone
Type:
Small organic molecule
Emp. Form.:
C25H28N2O2
Mol. Mass.:
388.502
SMILES:
O=C(N1CCCCC1)c1ccc(cc1)C1=CC2(CCNCC2)Oc2ccccc12
: